{"text_format":"3","workbook":"xlsx","n_sheets":6,"sheets":["DATOS","RESULTADOS POR JORNADA","TABLA DE POSICIONES","GRÁFICAS","Posiciones Auxiliar","Resultados Auxiliar"],"not_rendered":{"charts":6,"images":1,"macros":1,"defined_names":6},"read":"whole","date_system":"1900"}

{"sheet":"DATOS","index":0,"n_rows":19,"n_cols":9,"rows_kept":19,"merged":[[0,0,0,1]]}
["Puntaje",null,null,"Equipos",{"$nulls":4},1]
["Partido ganado",3,null,"AMERICA",{"$nulls":4},2]
["Partido empatado",1,null,"CRUZ AZUL",{"$nulls":4},3]
["Partido perdido",0,null,"CHIVAS",{"$nulls":4},4]
[{"$nulls":3},"PUMAS",{"$nulls":4},5]
["Cantidad de Equipos","18",null,"MONTERREY",{"$nulls":4},6]
[{"$nulls":3},"TIGRES",{"$nulls":4},7]
[{"$nulls":3},"MORELIA",{"$nulls":4},8]
[{"$nulls":3},"QUERETARO",{"$nulls":4},9]
[{"$nulls":3},"LEON",{"$nulls":4},10]
{"$rows_left_out":10}
{"sheet":"RESULTADOS POR JORNADA","index":1,"n_rows":78,"n_cols":43,"rows_kept":78,"merged":[[0,2,0,41],[2,0,41,0]]}
[null,null,"Visitante"]
[null,null,{"$f":"INDEX($B$3:$B$42,COLUMN()-2)","v":"AMERICA"},{"$f":"INDEX($B$3:$B$42,COLUMN()-2)","v":"CRUZ AZUL"},"CHIVAS","PUMAS","MONTERREY","TIGRES","MORELIA","QUERETARO","LEON","ATLAS","SANTOS","TIJUANA","LOBOS","PUEBLA","TOLUCA","VERACRUZ","PACHUCA","NECAXA",{"$error":"#REF!"},{"$error":"#REF!"},{"$error":"#REF!"},{"$error":"#REF!"},{"$error":"#REF!"},{"$error":"#REF!"},{"$error":"#REF!"},{"$error":"#REF!"},{"$error":"#REF!"},{"$error":"#REF!"},{"$error":"#REF!"},{"$error":"#REF!"},{"$error":"#REF!"},{"$error":"#REF!"},{"$error":"#REF!"},{"$error":"#REF!"},{"$error":"#REF!"},{"$error":"#REF!"},{"$error":"#REF!"},{"$error":"#REF!"},{"$error":"#REF!"},{"$error":"#REF!"}]
["Local",{"$f":"DATOS!D2","v":"AMERICA"},null,"0-0",{"$nulls":3},"3-0",null,"2-0","0-3",null,"1-0",null,"3-0","1-0",null,null,"3-0","1-3"]
[null,{"$f":"DATOS!D3","v":"CRUZ AZUL"},null,null,"0-1","2-1",null,null,"1-1","3-0",null,null,"1-2","1-0",{"$nulls":4},"4-1","2-1"]
[null,{"$f":"DATOS!D4","v":"CHIVAS"},"0-2",{"$nulls":3},"0-2",{"$nulls":3},"2-1","3-0",null,"2-0","0-1","1-3","1-0","0-0"]
[null,{"$f":"DATOS!D5","v":"PUMAS"},"1-0",null,"2-1",null,"1-1",null,"2-2",null,"1-3","2-2",null,"1-0",null,null,"2-2","0-0"]
[null,{"$f":"DATOS!D6","v":"MONTERREY"},"3-2","2-2",{"$nulls":3},"1-1",null,null,"2-2",null,"4-0",null,"4-0","0-0",null,null,"5-0","2-2"]
[null,{"$f":"DATOS!D7","v":"TIGRES"},null,"0-1","2-1","2-0",null,null,"3-3","4-1","2-2",null,"2-1",{"$nulls":5},"3-0","3-2"]
[null,{"$f":"DATOS!D8","v":"MORELIA"},"2-2",null,"1-0",null,"2-3",{"$nulls":3},"2-3","1-2",null,"1-4","1-1",null,"1-3","2-0"]
[null,{"$f":"DATOS!D9","v":"QUERETARO"},null,null,"0-0","0-2","1-2",null,"3-0",null,"0-4","1-2",null,"1-0",null,null,"0-0","2-1"]
{"$rows_left_out":41}
{"sheet":"TABLA DE POSICIONES","index":2,"n_rows":42,"n_cols":26,"rows_kept":42,"merged":[[0,2,0,9],[0,10,0,17],[0,18,0,25]]}
[null,null,"Local",{"$nulls":7},"Visitante",{"$nulls":7},"Total"]
["Pos","Equipo","J","G","E","P","GF","GC","DF","Pts.","J","G","E","P","GF","GC","DF","Pts.","J","G","E","P","GF","GC","DF","Pts."]
[1,{"$f":"VLOOKUP($A3,Posiciones_Auxiliar,COLUMN(),0)","v":"LEON"},8,7,0,1,19,5,14,21,9,{"$f":"VLOOKUP($A3,Posiciones_Auxiliar,COLUMN(),0)","v":6},2,1,22,9,13,20,17,13,2,2,41,14,27,41]
[2,"TIGRES",9,6,2,1,21,11,10,20,8,5,2,1,12,5,7,17,17,11,4,2,33,16,17,37]
[3,"MONTERREY",9,4,5,0,23,9,14,17,8,4,1,3,10,12,-2,13,17,8,6,3,33,21,12,30]
[4,"CRUZ AZUL",8,5,1,2,14,7,7,16,9,3,5,1,12,8,4,14,17,8,6,3,26,15,11,30]
[5,"AMERICA",9,6,1,2,14,6,8,19,8,3,1,4,14,13,1,10,17,9,2,6,28,19,9,29]
[6,"NECAXA",8,3,4,1,12,9,3,13,9,5,1,3,20,15,5,16,17,8,5,4,32,24,8,29]
[7,"PACHUCA",8,8,0,0,26,5,21,24,9,0,4,5,6,21,-15,4,17,8,4,5,32,26,6,28]
[8,"TIJUANA",8,6,0,2,17,8,9,18,9,3,1,5,8,12,-4,10,17,9,1,7,25,20,5,28]
{"$rows_left_out":33}
{"sheet":"GRÁFICAS","index":3,"n_rows":3,"n_cols":2,"rows_kept":3,"merged":[[2,1,2,5]]}
[]
[]
[null,"EQUIPO CON MAYOR PUNTUACIÓN EN EL TORNEO"]

{"sheet":"Posiciones Auxiliar","index":4,"n_rows":42,"n_cols":27,"rows_kept":42,"hidden":true,"merged":[[0,2,0,9],[0,10,0,17],[0,18,0,25]]}
[null,null,"Local",{"$nulls":7},"Visitante",{"$nulls":7},"Total"]
["Posicion","Equipo","J","G","E","P","GF","GC","DF","Pts.","J","G","E","P","GF","GC","DF","Pts.","J","G","E","P","GF","GC","DF","Pts.","Ranking"]
[{"$f":"RANK(AA3,$AA$3:$AA$42)","v":5},{"$f":"DATOS!D2","v":"AMERICA"},{"$f":"COUNTA('RESULTADOS POR JORNADA'!C3:AP3)","v":9},{"$f":"COUNTIF('Resultados Auxiliar'!B3:AP3,\">0\")","v":6},{"$f":"COUNTIF('Resultados Auxiliar'!B3:AP3,\"=0\")","v":1},{"$f":"COUNTIF('Resultados Auxiliar'!B3:AP3,\"<0\")","v":2},{"$f":"SUM(IF(ISNUMBER(--LEFT('RESULTADOS POR JORNADA'!C3:AP3,FIND(\"-\",'RESULTADOS POR JORNADA'!C3:AP3)-1)),--LEFT('RESULTADOS POR JORNADA'!C3:AP3,FIND(\"-\",'RESULTADOS POR JORNADA'!C3:AP3)-1)))","v":14},{"$f":"SUM(IF(ISNUMBER(--RIGHT('RESULTADOS POR JORNADA'!C3:AP3,(LEN('RESULTADOS POR JORNADA'!C3:AP3)-FIND(\"-\",'RESULTADOS POR JORNADA'!C3:AP3)))),--RIGHT('RESULTADOS POR JORNADA'!C3:AP3,(LEN('RESULTADOS POR JORNADA'!C3:AP3)-FIND(\"-\",'RESULTADOS POR JORNADA'!C3:AP3)))))","v":6},{"$f":"G3-H3","v":8},{"$f":"D3*Partido_ganado+E3*Partido_empatado+F3*Partido_perdido","v":19},{"$f":"COUNTA(INDEX('RESULTADOS POR JORNADA'!$A$3:$AP$42,,ROW()))","v":8},{"$f":"COUNTIF(INDEX('Resultados Auxiliar'!$B$3:$AO$42,,ROW()-2),\"<0\")","v":3},{"$f":"COUNTIF(INDEX('Resultados Auxiliar'!$B$3:$AO$42,,ROW()-2),\"=0\")","v":1},{"$f":"COUNTIF(INDEX('Resultados Auxiliar'!$B$3:$AO$42,,ROW()-2),\">0\")","v":4},{"$f":"SUM(IF(ISNUMBER(--RIGHT(rngVisitante,(LEN(rngVisitante)-FIND(\"-\",rngVisitante)))),--RIGHT(rngVisitante,(LEN(rngVisitante)-FIND(\"-\",rngVisitante)))))","v":14},{"$f":"SUM(IF(ISNUMBER(--LEFT(rngVisitante,FIND(\"-\",rngVisitante)-1)),--LEFT(rngVisitante,FIND(\"-\",rngVisitante)-1)))","v":13},{"$f":"O3-P3","v":1},{"$f":"L3*Partido_ganado+M3*Partido_empatado+N3*Partido_perdido","v":10},{"$f":"C3+K3","v":17},9,2,6,{"$f":"G3+O3","v":28},{"$f":"H3+P3","v":19},{"$f":"I3+Q3","v":9},{"$f":"J3+R3","v":29},{"$f":"IF(S3=0,-2000000-ROW(),Z3*10000000+Y3*10000+W3*100+(30-ROW()))","v":{"v":290092827,"d":"290,092,827"}}]
[{"$f":"RANK(AA4,$AA$3:$AA$42)","v":4},{"$f":"DATOS!D3","v":"CRUZ AZUL"},{"$f":"COUNTA('RESULTADOS POR JORNADA'!C4:AP4)","v":8},{"$f":"COUNTIF('Resultados Auxiliar'!B4:AP4,\">0\")","v":5},{"$f":"COUNTIF('Resultados Auxiliar'!B4:AP4,\"=0\")","v":1},{"$f":"COUNTIF('Resultados Auxiliar'!B4:AP4,\"<0\")","v":2},{"$f":"SUM(IF(ISNUMBER(--LEFT('RESULTADOS POR JORNADA'!C4:AP4,FIND(\"-\",'RESULTADOS POR JORNADA'!C4:AP4)-1)),--LEFT('RESULTADOS POR JORNADA'!C4:AP4,FIND(\"-\",'RESULTADOS POR JORNADA'!C4:AP4)-1)))","v":14},{"$f":"SUM(IF(ISNUMBER(--RIGHT('RESULTADOS POR JORNADA'!C4:AP4,(LEN('RESULTADOS POR JORNADA'!C4:AP4)-FIND(\"-\",'RESULTADOS POR JORNADA'!C4:AP4)))),--RIGHT('RESULTADOS POR JORNADA'!C4:AP4,(LEN('RESULTADOS POR JORNADA'!C4:AP4)-FIND(\"-\",'RESULTADOS POR JORNADA'!C4:AP4)))))","v":7},7,16,{"$f":"COUNTA(INDEX('RESULTADOS POR JORNADA'!$A$3:$AP$42,,ROW()))","v":9},{"$f":"COUNTIF(INDEX('Resultados Auxiliar'!$B$3:$AO$42,,ROW()-2),\"<0\")","v":3},{"$f":"COUNTIF(INDEX('Resultados Auxiliar'!$B$3:$AO$42,,ROW()-2),\"=0\")","v":5},{"$f":"COUNTIF(INDEX('Resultados Auxiliar'!$B$3:$AO$42,,ROW()-2),\">0\")","v":1},{"$f":"SUM(IF(ISNUMBER(--RIGHT(rngVisitante,(LEN(rngVisitante)-FIND(\"-\",rngVisitante)))),--RIGHT(rngVisitante,(LEN(rngVisitante)-FIND(\"-\",rngVisitante)))))","v":12},{"$f":"SUM(IF(ISNUMBER(--LEFT(rngVisitante,FIND(\"-\",rngVisitante)-1)),--LEFT(rngVisitante,FIND(\"-\",rngVisitante)-1)))","v":8},4,14,17,8,6,3,26,15,11,30,{"v":300112626,"d":"300,112,626"}]
[14,{"$f":"DATOS!D4","v":"CHIVAS"},{"$f":"COUNTA('RESULTADOS POR JORNADA'!C5:AP5)","v":9},{"$f":"COUNTIF('Resultados Auxiliar'!B5:AP5,\">0\")","v":4},{"$f":"COUNTIF('Resultados Auxiliar'!B5:AP5,\"=0\")","v":1},{"$f":"COUNTIF('Resultados Auxiliar'!B5:AP5,\"<0\")","v":4},{"$f":"SUM(IF(ISNUMBER(--LEFT('RESULTADOS POR JORNADA'!C5:AP5,FIND(\"-\",'RESULTADOS POR JORNADA'!C5:AP5)-1)),--LEFT('RESULTADOS POR JORNADA'!C5:AP5,FIND(\"-\",'RESULTADOS POR JORNADA'!C5:AP5)-1)))","v":9},{"$f":"SUM(IF(ISNUMBER(--RIGHT('RESULTADOS POR JORNADA'!C5:AP5,(LEN('RESULTADOS POR JORNADA'!C5:AP5)-FIND(\"-\",'RESULTADOS POR JORNADA'!C5:AP5)))),--RIGHT('RESULTADOS POR JORNADA'!C5:AP5,(LEN('RESULTADOS POR JORNADA'!C5:AP5)-FIND(\"-\",'RESULTADOS POR JORNADA'!C5:AP5)))))","v":9},0,13,{"$f":"COUNTA(INDEX('RESULTADOS POR JORNADA'!$A$3:$AP$42,,ROW()))","v":8},{"$f":"COUNTIF(INDEX('Resultados Auxiliar'!$B$3:$AO$42,,ROW()-2),\"<0\")","v":1},{"$f":"COUNTIF(INDEX('Resultados Auxiliar'!$B$3:$AO$42,,ROW()-2),\"=0\")","v":2},{"$f":"COUNTIF(INDEX('Resultados Auxiliar'!$B$3:$AO$42,,ROW()-2),\">0\")","v":5},{"$f":"SUM(IF(ISNUMBER(--RIGHT(rngVisitante,(LEN(rngVisitante)-FIND(\"-\",rngVisitante)))),--RIGHT(rngVisitante,(LEN(rngVisitante)-FIND(\"-\",rngVisitante)))))","v":7},{"$f":"SUM(IF(ISNUMBER(--LEFT(rngVisitante,FIND(\"-\",rngVisitante)-1)),--LEFT(rngVisitante,FIND(\"-\",rngVisitante)-1)))","v":12},-5,5,17,5,3,9,16,21,-5,18,{"v":179951625,"d":"179,951,625"}]
[15,{"$f":"DATOS!D5","v":"PUMAS"},{"$f":"COUNTA('RESULTADOS POR JORNADA'!C6:AP6)","v":9},{"$f":"COUNTIF('Resultados Auxiliar'!B6:AP6,\">0\")","v":3},{"$f":"COUNTIF('Resultados Auxiliar'!B6:AP6,\"=0\")","v":5},{"$f":"COUNTIF('Resultados Auxiliar'!B6:AP6,\"<0\")","v":1},{"$f":"SUM(IF(ISNUMBER(--LEFT('RESULTADOS POR JORNADA'!C6:AP6,FIND(\"-\",'RESULTADOS POR JORNADA'!C6:AP6)-1)),--LEFT('RESULTADOS POR JORNADA'!C6:AP6,FIND(\"-\",'RESULTADOS POR JORNADA'!C6:AP6)-1)))","v":12},{"$f":"SUM(IF(ISNUMBER(--RIGHT('RESULTADOS POR JORNADA'!C6:AP6,(LEN('RESULTADOS POR JORNADA'!C6:AP6)-FIND(\"-\",'RESULTADOS POR JORNADA'!C6:AP6)))),--RIGHT('RESULTADOS POR JORNADA'!C6:AP6,(LEN('RESULTADOS POR JORNADA'!C6:AP6)-FIND(\"-\",'RESULTADOS POR JORNADA'!C6:AP6)))))","v":11},1,14,{"$f":"COUNTA(INDEX('RESULTADOS POR JORNADA'!$A$3:$AP$42,,ROW()))","v":8},{"$f":"COUNTIF(INDEX('Resultados Auxiliar'!$B$3:$AO$42,,ROW()-2),\"<0\")","v":1},{"$f":"COUNTIF(INDEX('Resultados Auxiliar'!$B$3:$AO$42,,ROW()-2),\"=0\")","v":0},{"$f":"COUNTIF(INDEX('Resultados Auxiliar'!$B$3:$AO$42,,ROW()-2),\">0\")","v":7},{"$f":"SUM(IF(ISNUMBER(--RIGHT(rngVisitante,(LEN(rngVisitante)-FIND(\"-\",rngVisitante)))),--RIGHT(rngVisitante,(LEN(rngVisitante)-FIND(\"-\",rngVisitante)))))","v":7},{"$f":"SUM(IF(ISNUMBER(--LEFT(rngVisitante,FIND(\"-\",rngVisitante)-1)),--LEFT(rngVisitante,FIND(\"-\",rngVisitante)-1)))","v":15},-8,3,17,4,5,8,19,26,-7,17,{"v":169931924,"d":"169,931,924"}]
[3,{"$f":"DATOS!D6","v":"MONTERREY"},{"$f":"COUNTA('RESULTADOS POR JORNADA'!C7:AP7)","v":9},{"$f":"COUNTIF('Resultados Auxiliar'!B7:AP7,\">0\")","v":4},{"$f":"COUNTIF('Resultados Auxiliar'!B7:AP7,\"=0\")","v":5},{"$f":"COUNTIF('Resultados Auxiliar'!B7:AP7,\"<0\")","v":0},{"$f":"SUM(IF(ISNUMBER(--LEFT('RESULTADOS POR JORNADA'!C7:AP7,FIND(\"-\",'RESULTADOS POR JORNADA'!C7:AP7)-1)),--LEFT('RESULTADOS POR JORNADA'!C7:AP7,FIND(\"-\",'RESULTADOS POR JORNADA'!C7:AP7)-1)))","v":23},{"$f":"SUM(IF(ISNUMBER(--RIGHT('RESULTADOS POR JORNADA'!C7:AP7,(LEN('RESULTADOS POR JORNADA'!C7:AP7)-FIND(\"-\",'RESULTADOS POR JORNADA'!C7:AP7)))),--RIGHT('RESULTADOS POR JORNADA'!C7:AP7,(LEN('RESULTADOS POR JORNADA'!C7:AP7)-FIND(\"-\",'RESULTADOS POR JORNADA'!C7:AP7)))))","v":9},14,17,{"$f":"COUNTA(INDEX('RESULTADOS POR JORNADA'!$A$3:$AP$42,,ROW()))","v":8},{"$f":"COUNTIF(INDEX('Resultados Auxiliar'!$B$3:$AO$42,,ROW()-2),\"<0\")","v":4},{"$f":"COUNTIF(INDEX('Resultados Auxiliar'!$B$3:$AO$42,,ROW()-2),\"=0\")","v":1},{"$f":"COUNTIF(INDEX('Resultados Auxiliar'!$B$3:$AO$42,,ROW()-2),\">0\")","v":3},{"$f":"SUM(IF(ISNUMBER(--RIGHT(rngVisitante,(LEN(rngVisitante)-FIND(\"-\",rngVisitante)))),--RIGHT(rngVisitante,(LEN(rngVisitante)-FIND(\"-\",rngVisitante)))))","v":10},{"$f":"SUM(IF(ISNUMBER(--LEFT(rngVisitante,FIND(\"-\",rngVisitante)-1)),--LEFT(rngVisitante,FIND(\"-\",rngVisitante)-1)))","v":12},-2,{"$f":"L7*Partido_ganado+M7*Partido_empatado+N7*Partido_perdido","v":13},{"$f":"C7+K7","v":17},{"$f":"D7+L7","v":8},{"$f":"E7+M7","v":6},{"$f":"F7+N7","v":3},33,21,{"$f":"I7+Q7","v":12},{"$f":"J7+R7","v":30},{"v":300123323,"d":"300,123,323"}]
[2,{"$f":"DATOS!D7","v":"TIGRES"},{"$f":"COUNTA('RESULTADOS POR JORNADA'!C8:AP8)","v":9},{"$f":"COUNTIF('Resultados Auxiliar'!B8:AP8,\">0\")","v":6},{"$f":"COUNTIF('Resultados Auxiliar'!B8:AP8,\"=0\")","v":2},{"$f":"COUNTIF('Resultados Auxiliar'!B8:AP8,\"<0\")","v":1},{"$f":"SUM(IF(ISNUMBER(--LEFT('RESULTADOS POR JORNADA'!C8:AP8,FIND(\"-\",'RESULTADOS POR JORNADA'!C8:AP8)-1)),--LEFT('RESULTADOS POR JORNADA'!C8:AP8,FIND(\"-\",'RESULTADOS POR JORNADA'!C8:AP8)-1)))","v":21},{"$f":"SUM(IF(ISNUMBER(--RIGHT('RESULTADOS POR JORNADA'!C8:AP8,(LEN('RESULTADOS POR JORNADA'!C8:AP8)-FIND(\"-\",'RESULTADOS POR JORNADA'!C8:AP8)))),--RIGHT('RESULTADOS POR JORNADA'!C8:AP8,(LEN('RESULTADOS POR JORNADA'!C8:AP8)-FIND(\"-\",'RESULTADOS POR JORNADA'!C8:AP8)))))","v":11},10,20,{"$f":"COUNTA(INDEX('RESULTADOS POR JORNADA'!$A$3:$AP$42,,ROW()))","v":8},{"$f":"COUNTIF(INDEX('Resultados Auxiliar'!$B$3:$AO$42,,ROW()-2),\"<0\")","v":5},{"$f":"COUNTIF(INDEX('Resultados Auxiliar'!$B$3:$AO$42,,ROW()-2),\"=0\")","v":2},{"$f":"COUNTIF(INDEX('Resultados Auxiliar'!$B$3:$AO$42,,ROW()-2),\">0\")","v":1},{"$f":"SUM(IF(ISNUMBER(--RIGHT(rngVisitante,(LEN(rngVisitante)-FIND(\"-\",rngVisitante)))),--RIGHT(rngVisitante,(LEN(rngVisitante)-FIND(\"-\",rngVisitante)))))","v":12},{"$f":"SUM(IF(ISNUMBER(--LEFT(rngVisitante,FIND(\"-\",rngVisitante)-1)),--LEFT(rngVisitante,FIND(\"-\",rngVisitante)-1)))","v":5},7,17,17,11,4,2,33,16,17,37,{"v":370173322,"d":"370,173,322"}]
[16,{"$f":"DATOS!D8","v":"MORELIA"},{"$f":"COUNTA('RESULTADOS POR JORNADA'!C9:AP9)","v":9},{"$f":"COUNTIF('Resultados Auxiliar'!B9:AP9,\">0\")","v":2},{"$f":"COUNTIF('Resultados Auxiliar'!B9:AP9,\"=0\")","v":2},{"$f":"COUNTIF('Resultados Auxiliar'!B9:AP9,\"<0\")","v":5},{"$f":"SUM(IF(ISNUMBER(--LEFT('RESULTADOS POR JORNADA'!C9:AP9,FIND(\"-\",'RESULTADOS POR JORNADA'!C9:AP9)-1)),--LEFT('RESULTADOS POR JORNADA'!C9:AP9,FIND(\"-\",'RESULTADOS POR JORNADA'!C9:AP9)-1)))","v":13},{"$f":"SUM(IF(ISNUMBER(--RIGHT('RESULTADOS POR JORNADA'!C9:AP9,(LEN('RESULTADOS POR JORNADA'!C9:AP9)-FIND(\"-\",'RESULTADOS POR JORNADA'!C9:AP9)))),--RIGHT('RESULTADOS POR JORNADA'!C9:AP9,(LEN('RESULTADOS POR JORNADA'!C9:AP9)-FIND(\"-\",'RESULTADOS POR JORNADA'!C9:AP9)))))","v":18},{"$f":"G9-H9","v":-5},{"$f":"D9*Partido_ganado+E9*Partido_empatado+F9*Partido_perdido","v":8},{"$f":"COUNTA(INDEX('RESULTADOS POR JORNADA'!$A$3:$AP$42,,ROW()))","v":8},{"$f":"COUNTIF(INDEX('Resultados Auxiliar'!$B$3:$AO$42,,ROW()-2),\"<0\")","v":0},{"$f":"COUNTIF(INDEX('Resultados Auxiliar'!$B$3:$AO$42,,ROW()-2),\"=0\")","v":5},{"$f":"COUNTIF(INDEX('Resultados Auxiliar'!$B$3:$AO$42,,ROW()-2),\">0\")","v":3},{"$f":"SUM(IF(ISNUMBER(--RIGHT(rngVisitante,(LEN(rngVisitante)-FIND(\"-\",rngVisitante)))),--RIGHT(rngVisitante,(LEN(rngVisitante)-FIND(\"-\",rngVisitante)))))","v":7},{"$f":"SUM(IF(ISNUMBER(--LEFT(rngVisitante,FIND(\"-\",rngVisitante)-1)),--LEFT(rngVisitante,FIND(\"-\",rngVisitante)-1)))","v":13},{"$f":"O9-P9","v":-6},{"$f":"L9*Partido_ganado+M9*Partido_empatado+N9*Partido_perdido","v":5},{"$f":"C9+K9","v":17},{"$f":"D9+L9","v":2},{"$f":"E9+M9","v":7},{"$f":"F9+N9","v":8},{"$f":"G9+O9","v":20},{"$f":"H9+P9","v":31},{"$f":"I9+Q9","v":-11},{"$f":"J9+R9","v":13},{"$f":"IF(S9=0,-2000000-ROW(),Z9*10000000+Y9*10000+W9*100+(30-ROW()))","v":{"v":129892021,"d":"129,892,021"}}]
[17,{"$f":"DATOS!D9","v":"QUERETARO"},{"$f":"COUNTA('RESULTADOS POR JORNADA'!C10:AP10)","v":9},{"$f":"COUNTIF('Resultados Auxiliar'!B10:AP10,\">0\")","v":3},{"$f":"COUNTIF('Resultados Auxiliar'!B10:AP10,\"=0\")","v":2},{"$f":"COUNTIF('Resultados Auxiliar'!B10:AP10,\"<0\")","v":4},{"$f":"SUM(IF(ISNUMBER(--LEFT('RESULTADOS POR JORNADA'!C10:AP10,FIND(\"-\",'RESULTADOS POR JORNADA'!C10:AP10)-1)),--LEFT('RESULTADOS POR JORNADA'!C10:AP10,FIND(\"-\",'RESULTADOS POR JORNADA'!C10:AP10)-1)))","v":8},{"$f":"SUM(IF(ISNUMBER(--RIGHT('RESULTADOS POR JORNADA'!C10:AP10,(LEN('RESULTADOS POR JORNADA'!C10:AP10)-FIND(\"-\",'RESULTADOS POR JORNADA'!C10:AP10)))),--RIGHT('RESULTADOS POR JORNADA'!C10:AP10,(LEN('RESULTADOS POR JORNADA'!C10:AP10)-FIND(\"-\",'RESULTADOS POR JORNADA'!C10:AP10)))))","v":11},-3,11,{"$f":"COUNTA(INDEX('RESULTADOS POR JORNADA'!$A$3:$AP$42,,ROW()))","v":8},{"$f":"COUNTIF(INDEX('Resultados Auxiliar'!$B$3:$AO$42,,ROW()-2),\"<0\")","v":0},{"$f":"COUNTIF(INDEX('Resultados Auxiliar'!$B$3:$AO$42,,ROW()-2),\"=0\")","v":0},{"$f":"COUNTIF(INDEX('Resultados Auxiliar'!$B$3:$AO$42,,ROW()-2),\">0\")","v":8},{"$f":"SUM(IF(ISNUMBER(--RIGHT(rngVisitante,(LEN(rngVisitante)-FIND(\"-\",rngVisitante)))),--RIGHT(rngVisitante,(LEN(rngVisitante)-FIND(\"-\",rngVisitante)))))","v":3},{"$f":"SUM(IF(ISNUMBER(--LEFT(rngVisitante,FIND(\"-\",rngVisitante)-1)),--LEFT(rngVisitante,FIND(\"-\",rngVisitante)-1)))","v":19},-16,0,17,3,2,12,11,30,-19,11,{"v":109811120,"d":"109,811,120"}]
{"$rows_left_out":33}
{"sheet":"Resultados Auxiliar","index":5,"n_rows":42,"n_cols":41,"rows_kept":42,"hidden":true,"merged":[[1,1,1,6]]}
[]
[null,"Positivo=Ganado; Negativo=Perdido; Cero=Empate"]
[null,{"$f":"resultado","v":""},0,"","","",3,"",2,-3,"",1,"",3,1,"","",{"$f":"resultado","v":3},-2,"","","","","","","","","","","","","","",{"$f":"resultado","v":""},"","","","","","",{"$f":"resultado","v":""}]
[null,{"$f":"resultado","v":""},"",-1,1,"","",0,3,"","",-1,1,"","","","",{"$f":"resultado","v":3},1,"","","","","","","","","","","","","","","","","","","","","",""]
[null,-2,"","","",-2,"","","",1,3,"",2,-1,-2,1,0,"","","","","","","","","","","","","","","","","","","","","","","",""]
[null,1,"",1,"",0,"",0,"",-2,0,"",1,"","",0,0,"","","","","","","","","","","","","","","","","","","","","","","",""]
[null,1,0,"","","",0,"","",0,"",4,"",4,0,"","",5,0,"","","","","","","","","","","","","","","","","","","","","",""]
[null,"",-1,1,2,"","",0,3,0,"",1,"","","","","",3,1,"","","","","","","","","","","","","","","","","","","","","",""]
[null,0,"",1,"",-1,"","","",-1,-1,"",-3,0,"",-2,2,"","","","","","","","","","","","","","","","","","","","","","","",""]
[null,"","",0,-2,-1,"",3,"",-4,-1,"",1,"","",0,1,"","","","","","","","","","","","","","","","","","","","","","","",""]
{"$rows_left_out":32}